{"text_format":"1","workbook":"xlsx","n_sheets":3,"sheets":["Instructions","Entry Sheeet","Print Certificates"],"not_rendered":{"charts":0,"images":0,"macros":1,"external_links":1,"defined_names":3,"comments":0,"pivot_tables":0},"unopened":[],"bounds":{"document_bytes":16777216,"sheet_cells":100000,"rows_first":2000,"rows_last":500,"rows_between":2000,"halvings":0,"cell_chars":16384,"cell_head_chars":4096},"cells_cut":0,"cells_raw":0,"read":"whole","date_system":"1900"}

{"sheet":"Instructions","index":0,"n_rows":12,"n_cols":4,"rows_kept":12,"cut":false,"hidden":false,"merged":[[8,1,8,3],[7,1,7,3],[0,0,0,3],[3,1,3,2],[4,1,4,3],[5,1,5,3],[6,1,6,3],[1,0,1,3]]}
["Instructions"]
["Kindly read All Instructions before Use Character Certificate Utitly"]
[]
[1,"First Fill  Necessary Data for Certificate in Entry Sheet or  by click on ",null,"Fill Data"]
[2,"In All Sheet Use only or Click on  Yellow coloured Filled  Cell to Enter or Select Data. Rest Cell Are Locked"]
[3,"you can copy Paste Students Data Like Name ,Father Name, Class Etc.  From Epunjab Student Report. Or Enter Manually. Also Type Name in Punjabi Anmollipi Font"]
[4,"After Entered All data in yellow cell of  Entry  Sheet . Goto Report Certificate Sheet to View/Print report card of each Students"]
[5,"Please use Office 2010 and Above to find Better Results"]
[6,"Suggestion and Feedback Can be Send on Email Id-abhi072011@gmail.com"]
[7,"Please Visit My Website for More Tools and Utilities WWW."]
[null,"Subscribe Our Youtube Channel for Details Video"]
[null,"Follow Us On Facebook"]

{"sheet":"Entry Sheeet","index":1,"n_rows":466,"n_cols":19,"rows_kept":466,"cut":false,"hidden":false,"merged":[[4,0,4,1],[2,5,2,7],[3,5,3,7],[4,5,4,7],[1,0,1,10],[2,0,2,1],[3,0,3,1],[2,2,2,4],[3,2,3,4]]}
[]
["Auto Character Certificate Generate Utility. Please Fill In Only Yellow Cells In This Sheet And Click on Print CC to Print Certificate"]
["Enter School Name",null,"Govt. High School Khanna",null,null,"Block Name",null,null,"Khanna-2","District Name","Ludhiana"]
["pMjwbI iv`c skUl dw nwm ilKo",null,"srkwrI hweI skUl KMnw",null,null,"blwk dw nwm (pMjwbI)",null,null,"KMnw-2","ijlHw dw nwm","luiDAwxw"]
["Select Class",null,"Matric","Select Year",2023,"Select Total Marks",null,null,650,{"$f":"IF(C5=\"Middle\",\"A`TvIN\",IF(C5=\"Matric\",\"dsvIN\",IF(C5=\"Sr. Sec.\",\"bwrHvI\",\"bwrHvI\")))","v":"dsvIN"},null,null,null,null,null,null,"Middle",2022,650]
[null,null,null,null,null,null,null,null,null,null,null,null,null,null,null,null,"Matric",2023,450]
["Sr. no","Name","Father Name","Roll No.","No. of Year in School","Obtained Marks","%","Division","nwm","ipqw dw nwm","drjw",null,null,null,null,null,"Sr. Sec.",2024,600]
[1,"Ram 1","Sham Singh 1",102015102,5,250,{"$f":"(F8/$I$5)*100","v":38.461538461538467},{"$f":"IF(G8>=60,\"First\",IF(G8>=45,\"Second\",IF(G8>=33,\"Third\",\" \")))","v":"Third"},"rwm 1","swm isMG 1",{"$f":"IF(H8=\"First\",\"pihlw\",IF(H8=\"Second\",\"dUjy\",IF(H8=\"Third\",\"qIjy\",\"\")))","v":"qIjy"},null,null,null,null,null,"Senior Secondary",2025,500]
[2,"Ram 2","Sham Singh 2",102015103,5,300,{"$f":"(F9/$I$5)*100","v":46.153846153846153},{"$f":"IF(G9>=60,\"First\",IF(G9>=45,\"Second\",IF(G9>=33,\"Third\",\" \")))","v":"Second"},"rwm 2","swm isMG 2",{"$f":"IF(H9=\"First\",\"pihlw\",IF(H9=\"Second\",\"dUjy\",IF(H9=\"Third\",\"qIjy\",\"\")))","v":"dUjy"},null,null,null,null,null,null,2026,550]
[3,"Ram 3","Sham Singh 3",102015104,3,550,84.615384615384613,"First","rwm 3","swm isMG 3","pihlw",null,null,null,null,null,null,2027,400]
[4,"Ram 4","Sham Singh 4",102015105,4,250,38.461538461538467,"Third","rwm 4","swm isMG 4","qIjy",null,null,null,null,null,null,2028,700]
[5,"Ram 4",null,null,null,null,{"$f":"(F12/$I$5)*100","v":0}," ",null,null,"",null,null,null,null,null,null,2029,800]
[6,null,null,null,null,null,0,{"$f":"IF(G13>=60,\"First\",IF(G13>=45,\"Second\",IF(G13>=33,\"Third\",\" \")))","v":" "},null,null,"",null,null,null,null,null,null,2030,350]
[7,null,null,null,null,null,0," ",null,null,"",null,null,null,null,null,null,2031]
[8,null,null,null,null,null,0," ",null,null,{"$f":"IF(H15=\"First\",\"pihlw\",IF(H15=\"Second\",\"dUjy\",IF(H15=\"Third\",\"qIjy\",\"\")))","v":""},null,null,null,null,null,null,2032]
[9,null,null,null,null,null,0," ",null,null,""]
[10,null,null,null,null,null,0," ",null,null,""]
[11,null,null,null,null,null,0," ",null,null,""]
[12,null,null,null,null,null,0," ",null,null,""]
[13,null,null,null,null,null,0," ",null,null,""]
[14,null,null,null,null,null,0," ",null,null,""]
[15,null,null,null,null,null,0," ",null,null,""]
[16,null,null,null,null,null,0," ",null,null,""]
[17,null,null,null,null,null,0," ",null,null,""]
[18,null,null,null,null,null,0," ",null,null,""]
[19,null,null,null,null,null,0," ",null,null,""]
[20,null,null,null,null,null,0," ",null,null,""]
[21,null,null,null,null,null,0," ",null,null,""]
[22,null,null,null,null,null,0," ",null,null,""]
[23,null,null,null,null,null,0," ",null,null,""]
[24,null,null,null,null,null,0," ",null,null,""]
[25,null,null,null,null,null,0," ",null,null,""]
[26,null,null,null,null,null,0," ",null,null,""]
[27,null,null,null,null,null,0," ",null,null,""]
[28,null,null,null,null,null,0," ",null,null,""]
[29,null,null,null,null,null,0," ",null,null,""]
[30,null,null,null,null,null,0," ",null,null,""]
[31,null,null,null,null,null,0," ",null,null,""]
[32,null,null,null,null,null,0," ",null,null,""]
[33,null,null,null,null,null,0," ",null,null,""]
[34,null,null,null,null,null,0," ",null,null,""]
[35,null,null,null,null,null,0," ",null,null,""]
[36,null,null,null,null,null,0," ",null,null,""]
[37,null,null,null,null,null,0," ",null,null,""]
[38,null,null,null,null,null,0," ",null,null,""]
[39,null,null,null,null,null,0," ",null,null,""]
[40,null,null,null,null,null,0," ",null,null,""]
[41,null,null,null,null,null,0," ",null,null,""]
[42,null,null,null,null,null,0," ",null,null,""]
[43,null,null,null,null,null,0," ",null,null,""]
[44,null,null,null,null,null,0," ",null,null,""]
[45,null,null,null,null,null,0," ",null,null,""]
[46,null,null,null,null,null,0," ",null,null,""]
[47,null,null,null,null,null,0," ",null,null,""]
[48,null,null,null,null,null,0," ",null,null,""]
[49,null,null,null,null,null,0," ",null,null,""]
[50,null,null,null,null,null,0," ",null,null,""]
[51,null,null,null,null,null,0," ",null,null,""]
[52,null,null,null,null,null,0," ",null,null,""]
[53,null,null,null,null,null,0," ",null,null,""]
[54,null,null,null,null,null,0," ",null,null,""]
[55,null,null,null,null,null,0," ",null,null,""]
[56,null,null,null,null,null,0," ",null,null,""]
[57,null,null,null,null,null,0," ",null,null,""]
[58,null,null,null,null,null,0," ",null,null,""]
[59,null,null,null,null,null,0," ",null,null,""]
[60,null,null,null,null,null,0," ",null,null,""]
[61,null,null,null,null,null,0," ",null,null,""]
[62,null,null,null,null,null,0," ",null,null,""]
[63,null,null,null,null,null,0," ",null,null,""]
[64,null,null,null,null,null,0," ",null,null,""]
[65,null,null,null,null,null,0," ",null,null,""]
[66,null,null,null,null,null,{"$f":"(F73/$I$5)*100","v":0},{"$f":"IF(G73>=60,\"First\",IF(G73>=45,\"Second\",IF(G73>=33,\"Third\",\" \")))","v":" "},null,null,{"$f":"IF(H73=\"First\",\"pihlw\",IF(H73=\"Second\",\"dUjy\",IF(H73=\"Third\",\"qIjy\",\"\")))","v":""}]
[67,null,null,null,null,null,0," ",null,null,""]
[68,null,null,null,null,null,0," ",null,null,""]
[69,null,null,null,null,null,0," ",null,null,""]
[70,null,null,null,null,null,0," ",null,null,""]
[71,null,null,null,null,null,0," ",null,null,""]
[72,null,null,null,null,null,0," ",null,null,""]
[73,null,null,null,null,null,0," ",null,null,""]
[74,null,null,null,null,null,0," ",null,null,""]
[75,null,null,null,null,null,0," ",null,null,""]
[76,null,null,null,null,null,0," ",null,null,""]
[77,null,null,null,null,null,0," ",null,null,""]
[78,null,null,null,null,null,0," ",null,null,""]
[79,null,null,null,null,null,0," ",null,null,""]
[80,null,null,null,null,null,0," ",null,null,""]
[81,null,null,null,null,null,0," ",null,null,""]
[82,null,null,null,null,null,0," ",null,null,""]
[83,null,null,null,null,null,0," ",null,null,""]
[84,null,null,null,null,null,0," ",null,null,""]
[85,null,null,null,null,null,0," ",null,null,""]
[86,null,null,null,null,null,0," ",null,null,""]
[87,null,null,null,null,null,0," ",null,null,""]
[88,null,null,null,null,null,0," ",null,null,""]
[89,null,null,null,null,null,0," ",null,null,""]
[90,null,null,null,null,null,0," ",null,null,""]
[91,null,null,null,null,null,0," ",null,null,""]
[92,null,null,null,null,null,0," ",null,null,""]
[93,null,null,null,null,null,0," ",null,null,""]
[94,null,null,null,null,null,0," ",null,null,""]
[95,null,null,null,null,null,0," ",null,null,""]
[96,null,null,null,null,null,0," ",null,null,""]
[97,null,null,null,null,null,0," ",null,null,""]
[98,null,null,null,null,null,0," ",null,null,""]
[99,null,null,null,null,null,0," ",null,null,""]
[100,null,null,null,null,null,0," ",null,null,""]
[101,null,null,null,null,null,0," ",null,null,""]
[102,null,null,null,null,null,0," ",null,null,""]
[103,null,null,null,null,null,0," ",null,null,""]
[104,null,null,null,null,null,0," ",null,null,""]
[105,null,null,null,null,null,0," ",null,null,""]
[106,null,null,null,null,null,0," ",null,null,""]
[107,null,null,null,null,null,0," ",null,null,""]
[108,null,null,null,null,null,0," ",null,null,""]
[109,null,null,null,null,null,0," ",null,null,""]
[110,null,null,null,null,null,0," ",null,null,""]
[111,null,null,null,null,null,0," ",null,null,""]
[112,null,null,null,null,null,0," ",null,null,""]
[113,null,null,null,null,null,0," ",null,null,""]
[114,null,null,null,null,null,0," ",null,null,""]
[115,null,null,null,null,null,0," ",null,null,""]
[116,null,null,null,null,null,0," ",null,null,""]
[117,null,null,null,null,null,0," ",null,null,""]
[118,null,null,null,null,null,0," ",null,null,""]
[119,null,null,null,null,null,0," ",null,null,""]
[120,null,null,null,null,null,0," ",null,null,""]
[121,null,null,null,null,null,0," ",null,null,""]
[122,null,null,null,null,null,0," ",null,null,""]
[123,null,null,null,null,null,0," ",null,null,""]
[124,null,null,null,null,null,0," ",null,null,""]
[125,null,null,null,null,null,0," ",null,null,""]
[126,null,null,null,null,null,0," ",null,null,""]
[127,null,null,null,null,null,0," ",null,null,""]
[128,null,null,null,null,null,0," ",null,null,""]
[129,null,null,null,null,null,0," ",null,null,""]
[130,null,null,null,null,null,{"$f":"(F137/$I$5)*100","v":0},{"$f":"IF(G137>=60,\"First\",IF(G137>=45,\"Second\",IF(G137>=33,\"Third\",\" \")))","v":" "},null,null,{"$f":"IF(H137=\"First\",\"pihlw\",IF(H137=\"Second\",\"dUjy\",IF(H137=\"Third\",\"qIjy\",\"\")))","v":""}]
[131,null,null,null,null,null,0," ",null,null,""]
[132,null,null,null,null,null,0," ",null,null,""]
[133,null,null,null,null,null,0," ",null,null,""]
[134,null,null,null,null,null,0," ",null,null,""]
[135,null,null,null,null,null,0," ",null,null,""]
[136,null,null,null,null,null,0," ",null,null,""]
[137,null,null,null,null,null,0," ",null,null,""]
[138,null,null,null,null,null,0," ",null,null,""]
[139,null,null,null,null,null,0," ",null,null,""]
[140,null,null,null,null,null,0," ",null,null,""]
[141,null,null,null,null,null,0," ",null,null,""]
[142,null,null,null,null,null,0," ",null,null,""]
[143,null,null,null,null,null,0," ",null,null,""]
[144,null,null,null,null,null,0," ",null,null,""]
[145,null,null,null,null,null,0," ",null,null,""]
[146,null,null,null,null,null,0," ",null,null,""]
[147,null,null,null,null,null,0," ",null,null,""]
[148,null,null,null,null,null,0," ",null,null,""]
[149,null,null,null,null,null,0," ",null,null,""]
[150,null,null,null,null,null,0," ",null,null,""]
[151,null,null,null,null,null,0," ",null,null,""]
[152,null,null,null,null,null,0," ",null,null,""]
[153,null,null,null,null,null,0," ",null,null,""]
[154,null,null,null,null,null,0," ",null,null,""]
[155,null,null,null,null,null,0," ",null,null,""]
[156,null,null,null,null,null,0," ",null,null,""]
[157,null,null,null,null,null,0," ",null,null,""]
[158,null,null,null,null,null,0," ",null,null,""]
[159,null,null,null,null,null,0," ",null,null,""]
[160,null,null,null,null,null,0," ",null,null,""]
[161,null,null,null,null,null,0," ",null,null,""]
[162,null,null,null,null,null,0," ",null,null,""]
[163,null,null,null,null,null,0," ",null,null,""]
[164,null,null,null,null,null,0," ",null,null,""]
[165,null,null,null,null,null,0," ",null,null,""]
[166,null,null,null,null,null,0," ",null,null,""]
[167,null,null,null,null,null,0," ",null,null,""]
[168,null,null,null,null,null,0," ",null,null,""]
[169,null,null,null,null,null,0," ",null,null,""]
[170,null,null,null,null,null,0," ",null,null,""]
[171,null,null,null,null,null,0," ",null,null,""]
[172,null,null,null,null,null,0," ",null,null,""]
[173,null,null,null,null,null,0," ",null,null,""]
[174,null,null,null,null,null,0," ",null,null,""]
[175,null,null,null,null,null,0," ",null,null,""]
[176,null,null,null,null,null,0," ",null,null,""]
[177,null,null,null,null,null,0," ",null,null,""]
[178,null,null,null,null,null,0," ",null,null,""]
[179,null,null,null,null,null,0," ",null,null,""]
[180,null,null,null,null,null,0," ",null,null,""]
[181,null,null,null,null,null,0," ",null,null,""]
[182,null,null,null,null,null,0," ",null,null,""]
[183,null,null,null,null,null,0," ",null,null,""]
[184,null,null,null,null,null,0," ",null,null,""]
[185,null,null,null,null,null,0," ",null,null,""]
[186,null,null,null,null,null,0," ",null,null,""]
[187,null,null,null,null,null,0," ",null,null,""]
[188,null,null,null,null,null,0," ",null,null,""]
[189,null,null,null,null,null,0," ",null,null,""]
[190,null,null,null,null,null,0," ",null,null,""]
[191,null,null,null,null,null,0," ",null,null,""]
[192,null,null,null,null,null,0," ",null,null,""]
[193,null,null,null,null,null,0," ",null,null,""]
{"$rows_left_out":267}
{"sheet":"Print Certificates","index":2,"n_rows":41,"n_cols":14,"rows_kept":41,"cut":false,"hidden":false,"merged":[[0,10,43,10],[43,3,43,9],[24,3,24,4],[8,3,8,7],[39,6,39,7],[40,6,40,7],[3,3,3,8],[4,3,4,8],[28,5,28,8],[26,7,26,8],[30,7,30,8],[22,4,22,8],[24,5,24,8],[0,1,43,1],[42,2,43,2],[34,3,34,7],[6,4,6,6],[0,2,0,9],[12,4,12,7],[10,5,10,7],[18,6,18,7],[39,4,39,5]]}
[]
[]
[]
[null,null,null,{"$f":"'Entry Sheeet'!C4&\" blwk \"&'Entry Sheeet'!I4&\" ijlHw \"&'Entry Sheeet'!K4","v":"srkwrI hweI skUl KMnw blwk KMnw-2 ijlHw luiDAwxw"},null,null,null,null,null,null,null,null,"Total Number of Record",{"$f":"COUNTA('Entry Sheeet'!B8:B614)","v":5}]
[null,null,null,{"$f":"'Entry Sheeet'!C3&\" Block \"&'Entry Sheeet'!I3&\" Distt. \"&'Entry Sheeet'!K3","v":"Govt. High School Khanna Block Khanna-2 Distt. Ludhiana"}]
[null,null,null,null,null,null,null,null,null,null,null,null,"Record Number:",4]
[null,null,null,null,"Awcrx srtIiPkyt\n(Character Certificate)"]
[]
[null,null,null,{"$f":"\"Session \"&'Entry Sheeet'!E5-1&\"--\"&'Entry Sheeet'!E5","v":"Session 2022--2023"}]
[]
[null,null,null,"pRmwixq kIqw ","jWdw hY ik ",{"$f":"\"      \"&IFERROR(VLOOKUP($N$6,'Entry Sheeet'!$A$7:$BB$478,9,0),\"\")","v":"      rwm 4"}]
[]
[null,null,null,"p`uqr/pu`qrI SRI  ",{"$f":"\"  \"&IFERROR(VLOOKUP($N$6,'Entry Sheeet'!$A$7:$BB$478,10,0),\"\")","v":"  swm isMG 4"}]
[]
[null,null,null,"ies skUl iv`c          ",{"$f":"IFERROR(VLOOKUP($N$6,'Entry Sheeet'!$A$7:$BB$478,5,0),\"\") & \" swlW \"","v":"4 swlW "},"qoN ividAwrQI hY[aus ny",{"$f":"'Entry Sheeet'!J5","v":"dsvIN"},"jmwq dI pMjwb ","skUl"]
[]
[null,null,null,"is`iKAw borf dy                ","iemiqhwn",{"$f":"\"mwrc \"&'Entry Sheeet'!E5","v":"mwrc 2023"},"iv`c rol nM:",{"$f":"IFERROR(VLOOKUP($N$6,'Entry Sheeet'!$A$7:$BB$478,4,0),\"\")","v":102015105},"ADIn"]
[]
[null,null,null,{"$f":"IFERROR(VLOOKUP($N$6,'Entry Sheeet'!$A$7:$BB$478,6,0),\"\") &\"/\"&'Entry Sheeet'!$I$5&\" AMk\"","v":"250/650 AMk"},"pRwpq krky",{"$f":"IFERROR(VLOOKUP($N$6,'Entry Sheeet'!$A$7:$BB$478,11,0),\"\")","v":"qIjy"},"drjy iv`c pws kIqI["]
[]
[]
[]
[null,null,null,"Certified   that ",{"$f":"\"      \"&IFERROR(VLOOKUP($N$6,'Entry Sheeet'!$A$7:$BB$478,2,0),\"\")","v":"      Ram 4"}]
[]
[null,null,null,"Son/Daughter   of    Shri",null,{"$f":"\"      \"&IFERROR(VLOOKUP($N$6,'Entry Sheeet'!$A$7:$BB$478,3,0),\"\")","v":"      Sham Singh 4"}]
[]
[null,null,null,"has    been    a   Student  of   this   School    for  ",null,null,{"$f":"IFERROR(VLOOKUP($N$6,'Entry Sheeet'!$A$7:$BB$478,5,0),\"\")","v":4},"years.  He / she"]
[]
[null,null,null,"has    passed ",{"$f":"'Entry Sheeet'!C5","v":"Matric"},"   Examination   of     Punjab   School    Education"]
[]
[null,null,null,"Board  from  the school in",null,{"$f":"\"March \"&'Entry Sheeet'!E5","v":"March 2023"},"under roll no.    ",{"$f":"IFERROR(VLOOKUP($N$6,'Entry Sheeet'!$A$7:$BB$478,4,0),\"\")","v":102015105}]
[]
[null,null,null,"and  Secured ",{"$f":"IFERROR(VLOOKUP($N$6,'Entry Sheeet'!$A$7:$BB$478,6,0),\"\") &\"/\"&'Entry Sheeet'!$I$5","v":"250/650"},"__   Marks     in ",{"$f":"IFERROR(VLOOKUP($N$6,'Entry Sheeet'!$A$7:$BB$478,8,0),\"\")","v":"Third"},"Division."]
[]
[null,null,null,"He/She bears a good moral character."]
[]
[]
[]
[null,null,null,"Class In-charge /Teacher",null,null,"Principal/Headmaster"]
[null,null,null,"Date of Issue  : ",{"$f":"TODAY()","v":"2025-05-20"},null,{"$f":"'Entry Sheeet'!C3","v":"Govt. High School Khanna"}]
[null,null,null,null,null,null,{"$f":"'Entry Sheeet'!I3 &\" ( \"&'Entry Sheeet'!K3&\" )\"","v":"Khanna-2 ( Ludhiana )"}]